/Python/In file included from psycopg/psycopgmodule.c:28:./psycopg/psycopg.h:35:10: fatal error: Python.h: No such file or directory35 | #include <Python.h>| ^~~~~~~~~~compilation terminated.
In file included from psycopg/psycopgmodule.c:28:./psycopg/psycopg.h:35:10: fatal error: Python.h: No such file or directory35 | #include <Python.h>| ^~~~~~~~~~compilation terminated.
In file included from psycopg/psycopgmodule.c:28:./psycopg/psycopg.h:35:10: fatal error: Python.h: No such file or directory35 | #include | ^~~~~~~~~~compilation terminated.
0
Source: stackoverflow.com
In file included from psycopg/psycopgmodule.c:28:./psycopg/psycopg.h:35:10: fatal error: Python.h: No such file or directory35 | #include | ^~~~~~~~~~compilation terminated.
0
Source: stackoverflow.com
- 2 votes201 views1 answer
- 0 vote191 views1 answer
- 0 vote214 views1 answer
- 0 vote210 views1 answer
- 2 votes172 views1 answer
- 1 vote232 views2 answers
- 23 votes256 views5 answers
- 0 vote211 views1 answer
- 0 vote216 views2 answers
- 28 votes199 views5 answers